Information card for entry 7700664
Formula | C14 H10 N O8 Tb |
Calculated formula | C14 H10 N O8 Tb |
Title of publication | An excellently stable Tb<sup>III</sup>-organic framework with outstanding stability as a rapid, reversible, and multi-responsive luminescent sensor in water. |
Authors of publication | Guo, Feng; Su, Changhua; Fan, Yuhang; Shi, Wenbing |
Journal of publication | Dalton transactions (Cambridge, England : 2003) |
Year of publication | 2019 |
Journal volume | 48 |
Journal issue | 34 |
Pages of publication | 12910 - 12917 |
a | 11.479 ± 0.003 Å |
b | 10.535 ± 0.003 Å |
c | 22.524 ± 0.006 Å |
α | 90° |
β | 93.233 ± 0.005° |
γ | 90° |
Cell volume | 2719.5 ± 1.3 Å3 |
Cell temperature | 296 ± 2 K |
Ambient diffraction temperature | 296.15 K |
Number of distinct elements | 5 |
Space group number | 15 |
Hermann-Mauguin space group symbol | C 1 2/c 1 |
Hall space group symbol | -C 2yc |
Residual factor for all reflections | 0.0464 |
Residual factor for significantly intense reflections | 0.0365 |
Weighted residual factors for significantly intense reflections | 0.0833 |
Weighted residual factors for all reflections included in the refinement | 0.0863 |
Goodness-of-fit parameter for all reflections included in the refinement | 1.103 |
Diffraction radiation wavelength | 0.71073 Å |
Diffraction radiation type | MoKα |