Information card for entry 7700666
Formula | C20 H27 B10 N O2 |
Calculated formula | C20 H27 B10 N O2 |
Title of publication | Syntheses and quadratic nonlinear optical properties of 2,7-fluorenylene- and 1,4-phenylene-functionalized o-carboranes. |
Authors of publication | Jiang, Peng; Wang, Zhaojin; Moxey, Graeme J.; Morshedi, Mahbod; Barlow, Adam; Wang, Genmiao; Quintana, Cristóbal; Zhang, Chi; Cifuentes, Marie P.; Humphrey, Mark G. |
Journal of publication | Dalton transactions (Cambridge, England : 2003) |
Year of publication | 2019 |
Journal volume | 48 |
Journal issue | 33 |
Pages of publication | 12549 - 12559 |
a | 19.7572 ± 0.001 Å |
b | 7.1356 ± 0.0004 Å |
c | 16.9222 ± 0.0009 Å |
α | 90° |
β | 106.06 ± 0.005° |
γ | 90° |
Cell volume | 2292.6 ± 0.2 Å3 |
Cell temperature | 150.01 ± 0.1 K |
Ambient diffraction temperature | 150.01 ± 0.1 K |
Number of distinct elements | 5 |
Space group number | 14 |
Hermann-Mauguin space group symbol | P 1 21/c 1 |
Hall space group symbol | -P 2ybc |
Residual factor for all reflections | 0.0898 |
Residual factor for significantly intense reflections | 0.0643 |
Weighted residual factors for significantly intense reflections | 0.1585 |
Weighted residual factors for all reflections included in the refinement | 0.1802 |
Goodness-of-fit parameter for all reflections included in the refinement | 1.068 |
Diffraction radiation probe | x-ray |
Diffraction radiation wavelength | 1.54184 Å |
Diffraction radiation type | CuKα |