Information card for entry 7700669
Formula | C34 H33 B10 N |
Calculated formula | C34 H33 B10 N |
Title of publication | Syntheses and quadratic nonlinear optical properties of 2,7-fluorenylene- and 1,4-phenylene-functionalized o-carboranes. |
Authors of publication | Jiang, Peng; Wang, Zhaojin; Moxey, Graeme J.; Morshedi, Mahbod; Barlow, Adam; Wang, Genmiao; Quintana, Cristóbal; Zhang, Chi; Cifuentes, Marie P.; Humphrey, Mark G. |
Journal of publication | Dalton transactions (Cambridge, England : 2003) |
Year of publication | 2019 |
Journal volume | 48 |
Journal issue | 33 |
Pages of publication | 12549 - 12559 |
a | 18.7163 ± 0.0003 Å |
b | 17.1816 ± 0.0003 Å |
c | 9.89979 ± 0.00015 Å |
α | 90° |
β | 90° |
γ | 90° |
Cell volume | 3183.53 ± 0.09 Å3 |
Cell temperature | 150.01 ± 0.1 K |
Ambient diffraction temperature | 150.01 ± 0.1 K |
Number of distinct elements | 4 |
Space group number | 33 |
Hermann-Mauguin space group symbol | P n a 21 |
Hall space group symbol | P 2c -2n |
Residual factor for all reflections | 0.0558 |
Residual factor for significantly intense reflections | 0.0429 |
Weighted residual factors for significantly intense reflections | 0.091 |
Weighted residual factors for all reflections included in the refinement | 0.0989 |
Goodness-of-fit parameter for all reflections included in the refinement | 1.062 |
Diffraction radiation probe | x-ray |
Diffraction radiation wavelength | 0.71073 Å |
Diffraction radiation type | MoKα |