Information card for entry 7700671
Formula | C32 H37 B10 N |
Calculated formula | C32 H37 B10 N |
Title of publication | Syntheses and quadratic nonlinear optical properties of 2,7-fluorenylene- and 1,4-phenylene-functionalized o-carboranes. |
Authors of publication | Jiang, Peng; Wang, Zhaojin; Moxey, Graeme J.; Morshedi, Mahbod; Barlow, Adam; Wang, Genmiao; Quintana, Cristóbal; Zhang, Chi; Cifuentes, Marie P.; Humphrey, Mark G. |
Journal of publication | Dalton transactions (Cambridge, England : 2003) |
Year of publication | 2019 |
Journal volume | 48 |
Journal issue | 33 |
Pages of publication | 12549 - 12559 |
a | 10.853 ± 0.0005 Å |
b | 14.4693 ± 0.0007 Å |
c | 20.0555 ± 0.0009 Å |
α | 97.508 ± 0.004° |
β | 91.388 ± 0.004° |
γ | 90.186 ± 0.004° |
Cell volume | 3121.4 ± 0.3 Å3 |
Cell temperature | 150.01 ± 0.1 K |
Ambient diffraction temperature | 150.01 ± 0.1 K |
Number of distinct elements | 4 |
Space group number | 2 |
Hermann-Mauguin space group symbol | P -1 |
Hall space group symbol | -P 1 |
Residual factor for all reflections | 0.1533 |
Residual factor for significantly intense reflections | 0.1395 |
Weighted residual factors for significantly intense reflections | 0.381 |
Weighted residual factors for all reflections included in the refinement | 0.3894 |
Goodness-of-fit parameter for all reflections included in the refinement | 1.048 |
Diffraction radiation probe | x-ray |
Diffraction radiation wavelength | 1.54184 Å |
Diffraction radiation type | CuKα |