Information card for entry 7700677
Formula | C28 H51 B P2 Pd Ru |
Calculated formula | C28 H51 B P2 Pd Ru |
Title of publication | Synthesis, structural properties and reactivity of ruthenocene-based pincer Pd(ii) tetrahydroborate. |
Authors of publication | Safronov, Sergey V.; Gutsul, Evgenii I.; Golub, Igor E.; Dolgushin, Fedor M.; Nelubina, Yulia V.; Filippov, Oleg A.; Epstein, Lina M.; Peregudov, Alexander S.; Belkova, Natalia V.; Shubina, Elena S. |
Journal of publication | Dalton transactions (Cambridge, England : 2003) |
Year of publication | 2019 |
Journal volume | 48 |
Journal issue | 33 |
Pages of publication | 12720 - 12729 |
a | 10.9154 ± 0.0004 Å |
b | 18.1161 ± 0.0006 Å |
c | 15.8325 ± 0.0006 Å |
α | 90° |
β | 106.561 ± 0.0007° |
γ | 90° |
Cell volume | 3000.92 ± 0.19 Å3 |
Cell temperature | 120 ± 2 K |
Ambient diffraction temperature | 120 ± 2 K |
Number of distinct elements | 6 |
Space group number | 14 |
Hermann-Mauguin space group symbol | P 1 21/c 1 |
Hall space group symbol | -P 2ybc |
Residual factor for all reflections | 0.0361 |
Residual factor for significantly intense reflections | 0.0309 |
Weighted residual factors for significantly intense reflections | 0.0574 |
Weighted residual factors for all reflections included in the refinement | 0.0591 |
Goodness-of-fit parameter for all reflections included in the refinement | 1.195 |
Diffraction radiation wavelength | 0.71073 Å |
Diffraction radiation type | MoKα |