Information card for entry 7700682
Formula | Al Ba3 Br Se4 |
Calculated formula | Al Ba3 Br Se4 |
Title of publication | Structural modulation induced by M<sup>IIIA</sup> metals in Ba<sub>3</sub>MQ<sub>4</sub>X (M = Al, Ga, In; Q = S, Se; X = Cl, Br): an experimental and computational analysis. |
Authors of publication | Tudi, Abudukadi; Han, Shujuan; Abudurusuli, Ailijiang; Yu, Haohai; Yang, Zhihua; Pan, Shilie |
Journal of publication | Dalton transactions (Cambridge, England : 2003) |
Year of publication | 2019 |
Journal volume | 48 |
Journal issue | 33 |
Pages of publication | 12713 - 12719 |
a | 12.574 ± 0.003 Å |
b | 9.858 ± 0.002 Å |
c | 8.827 ± 0.002 Å |
α | 90° |
β | 90° |
γ | 90° |
Cell volume | 1094.1 ± 0.4 Å3 |
Cell temperature | 296 ± 2 K |
Ambient diffraction temperature | 296 ± 2 K |
Number of distinct elements | 4 |
Space group number | 62 |
Hermann-Mauguin space group symbol | P n m a |
Hall space group symbol | -P 2ac 2n |
Residual factor for all reflections | 0.0333 |
Residual factor for significantly intense reflections | 0.0254 |
Weighted residual factors for significantly intense reflections | 0.0562 |
Weighted residual factors for all reflections included in the refinement | 0.0599 |
Goodness-of-fit parameter for all reflections included in the refinement | 1.059 |
Diffraction radiation wavelength | 0.71073 Å |
Diffraction radiation type | MoKα |