Information card for entry 7700697
Formula | C24 H48 Cu Mo12 N8 O42 P |
Calculated formula | C24 H46 Cu Mo12 N8 O42 P |
Title of publication | Mo-Based crystal POMOFs with a high electrochemical capacitor performance. |
Authors of publication | Chai, Dongfeng; Xin, Jianjiao; Li, Bonan; Pang, Haijun; Ma, Huiyuan; Li, Kunqi; Xiao, Boxin; Wang, Xinming; Tan, Lichao |
Journal of publication | Dalton transactions (Cambridge, England : 2003) |
Year of publication | 2019 |
Journal volume | 48 |
Journal issue | 34 |
Pages of publication | 13026 - 13033 |
a | 9.9018 ± 0.001 Å |
b | 12.9988 ± 0.0014 Å |
c | 13.0338 ± 0.0013 Å |
α | 71.275 ± 0.002° |
β | 71.686 ± 0.002° |
γ | 72.474 ± 0.002° |
Cell volume | 1470.4 ± 0.3 Å3 |
Cell temperature | 298 K |
Ambient diffraction temperature | 298 K |
Number of distinct elements | 7 |
Space group number | 2 |
Hermann-Mauguin space group symbol | P -1 |
Hall space group symbol | -P 1 |
Residual factor for all reflections | 0.0369 |
Residual factor for significantly intense reflections | 0.0325 |
Weighted residual factors for significantly intense reflections | 0.0745 |
Weighted residual factors for all reflections included in the refinement | 0.0769 |
Goodness-of-fit parameter for all reflections included in the refinement | 1.04 |
Diffraction radiation wavelength | 0.71 Å |
Diffraction radiation type | MoKα |