Information card for entry 7700699
Formula | Ca H I3 O9 |
Calculated formula | Ca H I3 O9 |
Title of publication | Synthesis, structure and characterization of M(IO<sub>3</sub>)<sub>2</sub>(HIO<sub>3</sub>) (M = Ca, Sr) as new anhydrous alkaline earth metal bis-iodate hydrogeniodate compounds. |
Authors of publication | An, Yawen; Zhong, Yang; Sun, Tongqing; Wang, Haijun; Hu, Zhenpeng; Liu, Hongde; Liu, Shiguo; Kong, Yongfa; Xu, Jingjun |
Journal of publication | Dalton transactions (Cambridge, England : 2003) |
Year of publication | 2019 |
Journal volume | 48 |
Journal issue | 34 |
Pages of publication | 13074 - 13080 |
a | 6.9647 ± 0.0014 Å |
b | 15.719 ± 0.003 Å |
c | 7.2042 ± 0.0014 Å |
α | 90° |
β | 92.76 ± 0.03° |
γ | 90° |
Cell volume | 787.8 ± 0.3 Å3 |
Cell temperature | 293 ± 2 K |
Ambient diffraction temperature | 293 ± 2 K |
Number of distinct elements | 4 |
Space group number | 14 |
Hermann-Mauguin space group symbol | P 1 21/c 1 |
Hall space group symbol | -P 2ybc |
Residual factor for all reflections | 0.0358 |
Residual factor for significantly intense reflections | 0.0346 |
Weighted residual factors for significantly intense reflections | 0.0843 |
Weighted residual factors for all reflections included in the refinement | 0.085 |
Goodness-of-fit parameter for all reflections included in the refinement | 1.217 |
Diffraction radiation wavelength | 0.71073 Å |
Diffraction radiation type | MoKα |