Information card for entry 7700707
Formula | C14 H20 Cl2.5 N4 O4 Se2 |
Calculated formula | C14 H20 Cl2.5 N4 O4 Se2 |
Title of publication | Synthetic and structural investigations of bis(N-alkyl-benzoselenadiazolium) cations. |
Authors of publication | Lee, Lucia Myongwon; Corless, Victoria; Luu, Helen; He, Allan; Jenkins, Hilary; Britten, James F.; Adam Pani, Faisal; Vargas-Baca, Ignacio |
Journal of publication | Dalton transactions (Cambridge, England : 2003) |
Year of publication | 2019 |
Journal volume | 48 |
Journal issue | 33 |
Pages of publication | 12541 - 12548 |
a | 7.624 ± 0.002 Å |
b | 7.942 ± 0.002 Å |
c | 18.27 ± 0.005 Å |
α | 77.649 ± 0.005° |
β | 83.56 ± 0.005° |
γ | 71.357 ± 0.004° |
Cell volume | 1022.8 ± 0.5 Å3 |
Cell temperature | 296 ± 2 K |
Ambient diffraction temperature | 296.15 K |
Number of distinct elements | 6 |
Space group number | 2 |
Hermann-Mauguin space group symbol | P -1 |
Hall space group symbol | -P 1 |
Residual factor for all reflections | 0.0699 |
Residual factor for significantly intense reflections | 0.0564 |
Weighted residual factors for significantly intense reflections | 0.1387 |
Weighted residual factors for all reflections included in the refinement | 0.1459 |
Goodness-of-fit parameter for all reflections included in the refinement | 1.068 |
Diffraction radiation wavelength | 0.71073 Å |
Diffraction radiation type | MoKα |