Information card for entry 7700718
Formula | C40 H65 B2 N8 Ni O |
Calculated formula | C40 H66 B2 N8 Ni O |
Title of publication | Synthesis and characterization of bis(pyrazolyl)borate Ni(ii) complexes: ligand rearrangement and transformation. |
Authors of publication | Zhao, Qianyi; Guan, Xin-Ting; Dou, Ting; Cao, Hou-Ji; Ma, Na-Na; Xu, Ting; Gao, Peng-Hui; Kong, Xiao-Hua; Zhang, Jie; Chen, Xuenian |
Journal of publication | Dalton transactions (Cambridge, England : 2003) |
Year of publication | 2019 |
Journal volume | 48 |
Journal issue | 35 |
Pages of publication | 13242 - 13247 |
a | 11.0018 ± 0.0001 Å |
b | 10.8736 ± 0.0002 Å |
c | 34.0677 ± 0.0003 Å |
α | 90° |
β | 90.903 ± 0.001° |
γ | 90° |
Cell volume | 4074.98 ± 0.09 Å3 |
Cell temperature | 100.01 ± 0.1 K |
Ambient diffraction temperature | 100.01 ± 0.1 K |
Number of distinct elements | 6 |
Space group number | 14 |
Hermann-Mauguin space group symbol | P 1 21/c 1 |
Hall space group symbol | -P 2ybc |
Residual factor for all reflections | 0.0901 |
Residual factor for significantly intense reflections | 0.0621 |
Weighted residual factors for significantly intense reflections | 0.1687 |
Weighted residual factors for all reflections included in the refinement | 0.1869 |
Goodness-of-fit parameter for all reflections included in the refinement | 1.018 |
Diffraction radiation probe | x-ray |
Diffraction radiation wavelength | 1.54184 Å |
Diffraction radiation type | CuKα |