Information card for entry 7700737
Formula | C24 H16 Cl2 Cu N4 |
Calculated formula | C24 H16 Cl2 Cu N4 |
Title of publication | Copper(ii) complexes with 2,2':6',2''-terpyridine, 2,6-di(thiazol-2-yl)pyridine and 2,6-di(pyrazin-2-yl)pyridine substituted with quinolines. Synthesis, structure, antiproliferative activity, and catalytic activity in the oxidation of alkanes and alcohols with peroxides. |
Authors of publication | Choroba, Katarzyna; Machura, Barbara; Kula, Slawomir; Raposo, Luis R.; Fernandes, Alexandra R.; Kruszynski, Rafal; Erfurt, Karol; Shul'pina, Lidia S.; Kozlov, Yuriy N.; Shul'pin, Georgiy B. |
Journal of publication | Dalton transactions (Cambridge, England : 2003) |
Year of publication | 2019 |
Journal volume | 48 |
Journal issue | 33 |
Pages of publication | 12656 - 12673 |
a | 7.7287 ± 0.0003 Å |
b | 14.2823 ± 0.0007 Å |
c | 18.7465 ± 0.0009 Å |
α | 90° |
β | 97.268 ± 0.004° |
γ | 90° |
Cell volume | 2052.68 ± 0.16 Å3 |
Cell temperature | 295 ± 2 K |
Ambient diffraction temperature | 295 ± 2 K |
Number of distinct elements | 5 |
Space group number | 14 |
Hermann-Mauguin space group symbol | P 1 21/c 1 |
Hall space group symbol | -P 2ybc |
Residual factor for all reflections | 0.0466 |
Residual factor for significantly intense reflections | 0.0323 |
Weighted residual factors for significantly intense reflections | 0.0725 |
Weighted residual factors for all reflections included in the refinement | 0.0776 |
Goodness-of-fit parameter for all reflections included in the refinement | 1.026 |
Diffraction radiation wavelength | 0.71073 Å |
Diffraction radiation type | MoKα |