Information card for entry 7700739
Formula | C23 H18 Cl2 Cu N6 O |
Calculated formula | C23 H18 Cl2 Cu N6 O |
Title of publication | Copper(ii) complexes with 2,2':6',2''-terpyridine, 2,6-di(thiazol-2-yl)pyridine and 2,6-di(pyrazin-2-yl)pyridine substituted with quinolines. Synthesis, structure, antiproliferative activity, and catalytic activity in the oxidation of alkanes and alcohols with peroxides. |
Authors of publication | Choroba, Katarzyna; Machura, Barbara; Kula, Slawomir; Raposo, Luis R.; Fernandes, Alexandra R.; Kruszynski, Rafal; Erfurt, Karol; Shul'pina, Lidia S.; Kozlov, Yuriy N.; Shul'pin, Georgiy B. |
Journal of publication | Dalton transactions (Cambridge, England : 2003) |
Year of publication | 2019 |
Journal volume | 48 |
Journal issue | 33 |
Pages of publication | 12656 - 12673 |
a | 7.8743 ± 0.0003 Å |
b | 10.5456 ± 0.0007 Å |
c | 13.8368 ± 0.0009 Å |
α | 97.81 ± 0.005° |
β | 96.724 ± 0.004° |
γ | 93.962 ± 0.004° |
Cell volume | 1126.28 ± 0.11 Å3 |
Cell temperature | 295 ± 2 K |
Ambient diffraction temperature | 295 ± 2 K |
Number of distinct elements | 6 |
Space group number | 2 |
Hermann-Mauguin space group symbol | P -1 |
Hall space group symbol | -P 1 |
Residual factor for all reflections | 0.0439 |
Residual factor for significantly intense reflections | 0.0328 |
Weighted residual factors for significantly intense reflections | 0.0759 |
Weighted residual factors for all reflections included in the refinement | 0.081 |
Goodness-of-fit parameter for all reflections included in the refinement | 1.049 |
Diffraction radiation wavelength | 0.71073 Å |
Diffraction radiation type | MoKα |