Information card for entry 7700741
Formula | C24 H16 Cl2 Cu N4 |
Calculated formula | C24 H16 Cl2 Cu N4 |
Title of publication | Copper(ii) complexes with 2,2':6',2''-terpyridine, 2,6-di(thiazol-2-yl)pyridine and 2,6-di(pyrazin-2-yl)pyridine substituted with quinolines. Synthesis, structure, antiproliferative activity, and catalytic activity in the oxidation of alkanes and alcohols with peroxides. |
Authors of publication | Choroba, Katarzyna; Machura, Barbara; Kula, Slawomir; Raposo, Luis R.; Fernandes, Alexandra R.; Kruszynski, Rafal; Erfurt, Karol; Shul'pina, Lidia S.; Kozlov, Yuriy N.; Shul'pin, Georgiy B. |
Journal of publication | Dalton transactions (Cambridge, England : 2003) |
Year of publication | 2019 |
Journal volume | 48 |
Journal issue | 33 |
Pages of publication | 12656 - 12673 |
a | 7.9474 ± 0.0005 Å |
b | 22.7151 ± 0.0011 Å |
c | 11.6628 ± 0.0006 Å |
α | 90° |
β | 92.888 ± 0.006° |
γ | 90° |
Cell volume | 2102.8 ± 0.2 Å3 |
Cell temperature | 295 ± 2 K |
Ambient diffraction temperature | 295 ± 2 K |
Number of distinct elements | 5 |
Space group number | 14 |
Hermann-Mauguin space group symbol | P 1 21/n 1 |
Hall space group symbol | -P 2yn |
Residual factor for all reflections | 0.1058 |
Residual factor for significantly intense reflections | 0.0629 |
Weighted residual factors for significantly intense reflections | 0.1201 |
Weighted residual factors for all reflections included in the refinement | 0.131 |
Goodness-of-fit parameter for all reflections included in the refinement | 1.069 |
Diffraction radiation wavelength | 0.71073 Å |
Diffraction radiation type | MoKα |