Information card for entry 7700749
Common name | [InBr2(N3Dmp2)] |
Formula | C50 H55 Br2 In N3 O0.5 |
Calculated formula | C50 H55 Br2 In N3 O0.5 |
Title of publication | Kinetic stabilization of low-oxidation state and terminal hydrido main group metal complexes by a sterically demanding N,N'-bis(2,6-terphenyl)triazenide. |
Authors of publication | Leverett, Anthony R.; Diachenko, Vera; Cole, Marcus L.; McKay, Alasdair I. |
Journal of publication | Dalton transactions (Cambridge, England : 2003) |
Year of publication | 2019 |
Journal volume | 48 |
Journal issue | 35 |
Pages of publication | 13197 - 13204 |
a | 11.0858 ± 0.0009 Å |
b | 11.1952 ± 0.0009 Å |
c | 19.8902 ± 0.0013 Å |
α | 80.214 ± 0.002° |
β | 78.334 ± 0.003° |
γ | 70.584 ± 0.002° |
Cell volume | 2265.9 ± 0.3 Å3 |
Cell temperature | 150 ± 2 K |
Ambient diffraction temperature | 150 K |
Number of distinct elements | 6 |
Space group number | 2 |
Hermann-Mauguin space group symbol | P -1 |
Hall space group symbol | -P 1 |
Residual factor for all reflections | 0.0607 |
Residual factor for significantly intense reflections | 0.0371 |
Weighted residual factors for significantly intense reflections | 0.0787 |
Weighted residual factors for all reflections included in the refinement | 0.0863 |
Goodness-of-fit parameter for all reflections included in the refinement | 1.009 |
Diffraction radiation wavelength | 0.71073 Å |
Diffraction radiation type | MoKα |