Information card for entry 7700766
Formula | C144 H118 Ag2 N2 O38 P2 Ti8 |
Calculated formula | C144 H118 Ag2 N2 O38 P2 Ti8 |
Title of publication | A series of silver doped butterfly-like Ti<sub>8</sub>Ag<sub>2</sub> clusters with two Ag ions panelled on a Ti<sub>8</sub> surface. |
Authors of publication | Yu, You-Zhu; Guo, Yao; Zhang, Yan-Ru; Liu, Min-Min; Feng, Ya-Ru; Geng, Cui-Huan; Zhang, Xian-Ming |
Journal of publication | Dalton transactions (Cambridge, England : 2003) |
Year of publication | 2019 |
Journal volume | 48 |
Journal issue | 35 |
Pages of publication | 13423 - 13429 |
a | 14.2246 ± 0.0009 Å |
b | 15.459 ± 0.0009 Å |
c | 18.8915 ± 0.0011 Å |
α | 67.905 ± 0.006° |
β | 82.025 ± 0.005° |
γ | 65.532 ± 0.006° |
Cell volume | 3502.7 ± 0.4 Å3 |
Cell temperature | 293 ± 2 K |
Ambient diffraction temperature | 293 ± 2 K |
Number of distinct elements | 7 |
Space group number | 2 |
Hermann-Mauguin space group symbol | P -1 |
Hall space group symbol | -P 1 |
Residual factor for all reflections | 0.0642 |
Residual factor for significantly intense reflections | 0.0506 |
Weighted residual factors for significantly intense reflections | 0.1316 |
Weighted residual factors for all reflections included in the refinement | 0.1434 |
Goodness-of-fit parameter for all reflections included in the refinement | 1.033 |
Diffraction radiation probe | x-ray |
Diffraction radiation wavelength | 1.54184 Å |
Diffraction radiation type | CuKα |