Information card for entry 7700776
Formula | C24 H33 F6 N2 O3 P2 Re |
Calculated formula | C24 H33 F6 N2 O3 P2 Re |
Title of publication | Steric influence of salicylaldehyde-based Schiff base ligands on the formation of trans-[Re(PR<sub>3</sub>)<sub>2</sub>(Schiff base)]<sup>+</sup> complexes. |
Authors of publication | Baumeister, Jakob E.; Mitchell, Andrew W.; Kelley, Steven P.; Barnes, Charles L.; Jurisson, Silvia S. |
Journal of publication | Dalton transactions (Cambridge, England : 2003) |
Year of publication | 2019 |
Journal volume | 48 |
Journal issue | 34 |
Pages of publication | 12943 - 12955 |
a | 8.7506 ± 0.0003 Å |
b | 10.9321 ± 0.0004 Å |
c | 29.4316 ± 0.0011 Å |
α | 90° |
β | 90.9445 ± 0.0012° |
γ | 90° |
Cell volume | 2815.12 ± 0.18 Å3 |
Cell temperature | 100 K |
Ambient diffraction temperature | 100 K |
Number of distinct elements | 7 |
Space group number | 14 |
Hermann-Mauguin space group symbol | P 1 21/n 1 |
Hall space group symbol | -P 2yn |
Residual factor for all reflections | 0.0311 |
Residual factor for significantly intense reflections | 0.0307 |
Weighted residual factors for significantly intense reflections | 0.0643 |
Weighted residual factors for all reflections included in the refinement | 0.0644 |
Goodness-of-fit parameter for all reflections included in the refinement | 1.39 |
Diffraction radiation wavelength | 0.71073 Å |
Diffraction radiation type | MoKα |