Information card for entry 7700780
Formula | C27 H20 Co2 N4 O8 |
Calculated formula | C27 H18 Co2 N4 O7 |
Title of publication | Three 3D Co(ii) cluster-based MOFs constructed from polycarboxylate acids and bis(imidazole) ligands and their derivatives: magnetic properties and catalytic performance for the ORR. |
Authors of publication | Yang, Ming-Xing; Chen, Li-Juan; Ma, Rong; Cai, Jian-Nan; Shi, Yuan-De; Lin, Shen |
Journal of publication | Dalton transactions (Cambridge, England : 2003) |
Year of publication | 2019 |
Journal volume | 48 |
Journal issue | 35 |
Pages of publication | 13369 - 13377 |
a | 15.8312 ± 0.0012 Å |
b | 11.1386 ± 0.0008 Å |
c | 27.232 ± 0.003 Å |
α | 90° |
β | 99.996 ± 0.005° |
γ | 90° |
Cell volume | 4729.1 ± 0.7 Å3 |
Cell temperature | 293 ± 2 K |
Ambient diffraction temperature | 293 ± 2 K |
Number of distinct elements | 5 |
Space group number | 14 |
Hermann-Mauguin space group symbol | P 1 21/c 1 |
Hall space group symbol | -P 2ybc |
Residual factor for all reflections | 0.0645 |
Residual factor for significantly intense reflections | 0.05 |
Weighted residual factors for significantly intense reflections | 0.1238 |
Weighted residual factors for all reflections included in the refinement | 0.1302 |
Goodness-of-fit parameter for all reflections included in the refinement | 1.032 |
Diffraction radiation wavelength | 0.71073 Å |
Diffraction radiation type | MoKα |