Information card for entry 7700787
Formula | C19 H7 B F10 N2 O |
Calculated formula | C19 H7 B F10 N2 O |
Title of publication | Reactions of hydrazones and hydrazides with Lewis acidic boranes. |
Authors of publication | Gazis, Theodore A.; Dasgupta, Ayan; Hill, Michael S.; Rawson, Jeremy M.; Wirth, Thomas; Melen, Rebecca L. |
Journal of publication | Dalton transactions (Cambridge, England : 2003) |
Year of publication | 2019 |
Journal volume | 48 |
Journal issue | 33 |
Pages of publication | 12391 - 12395 |
a | 11.8326 ± 0.0005 Å |
b | 12.0001 ± 0.0007 Å |
c | 13.9711 ± 0.0006 Å |
α | 73.338 ± 0.004° |
β | 89.047 ± 0.003° |
γ | 75.159 ± 0.004° |
Cell volume | 1833.64 ± 0.16 Å3 |
Cell temperature | 100 ± 2 K |
Ambient diffraction temperature | 150 ± 2 K |
Number of distinct elements | 6 |
Space group number | 2 |
Hermann-Mauguin space group symbol | P -1 |
Hall space group symbol | -P 1 |
Residual factor for all reflections | 0.0717 |
Residual factor for significantly intense reflections | 0.0517 |
Weighted residual factors for significantly intense reflections | 0.1282 |
Weighted residual factors for all reflections included in the refinement | 0.1473 |
Goodness-of-fit parameter for all reflections included in the refinement | 1.043 |
Diffraction radiation wavelength | 0.71073 Å |
Diffraction radiation type | MoKα |