Information card for entry 7700797
Formula | C65 H52 Cl5 Gd2 N8 O6 |
Calculated formula | C65 H52 Cl5 Gd2 N8 O6 |
Title of publication | Controllable syntheses and magnetic properties of novel homoleptic triple-decker lanthanide complexes. |
Authors of publication | Gao, Feng; Wang, Lei; Zhu, Guang-Zhou; Liu, Yu-Han; Yang, Han; Li, Xiang; Yang, Ke |
Journal of publication | Dalton transactions (Cambridge, England : 2003) |
Year of publication | 2019 |
Journal volume | 48 |
Journal issue | 35 |
Pages of publication | 13360 - 13368 |
a | 12.9649 ± 0.0019 Å |
b | 13.264 ± 0.002 Å |
c | 17.992 ± 0.003 Å |
α | 87.037 ± 0.005° |
β | 88.854 ± 0.005° |
γ | 77.955 ± 0.005° |
Cell volume | 3021.7 ± 0.8 Å3 |
Cell temperature | 296 ± 2 K |
Ambient diffraction temperature | 296 ± 2 K |
Number of distinct elements | 6 |
Space group number | 2 |
Hermann-Mauguin space group symbol | P -1 |
Hall space group symbol | -P 1 |
Residual factor for all reflections | 0.08 |
Residual factor for significantly intense reflections | 0.0394 |
Weighted residual factors for significantly intense reflections | 0.0699 |
Weighted residual factors for all reflections included in the refinement | 0.0808 |
Goodness-of-fit parameter for all reflections included in the refinement | 1.011 |
Diffraction radiation wavelength | 0.71073 Å |
Diffraction radiation type | MoKα |