Information card for entry 7700825
Formula | C37 H27 B N2 |
Calculated formula | C37 H27 B N2 |
Title of publication | Boron complexes of aromatic 5-substituted iminopyrrolyl ligands: synthesis, structure, and luminescence properties. |
Authors of publication | Rodrigues, Ana I.; Figueira, Cláudia A; Gomes, Clara S. B.; Suresh, D.; Ferreira, Bruno; Di Paolo, Roberto E.; Pereira, Daniel de Sa; Dias, Fernando B.; Calhorda, Maria José; Morgado, Jorge; Maçanita, António L; Gomes, Pedro T. |
Journal of publication | Dalton transactions (Cambridge, England : 2003) |
Year of publication | 2019 |
Journal volume | 48 |
Journal issue | 35 |
Pages of publication | 13337 - 13352 |
a | 12.435 ± 0.003 Å |
b | 15.353 ± 0.004 Å |
c | 13.984 ± 0.003 Å |
α | 90° |
β | 91.186 ± 0.009° |
γ | 90° |
Cell volume | 2669.2 ± 1.1 Å3 |
Cell temperature | 150 ± 2 K |
Ambient diffraction temperature | 150 ± 2 K |
Number of distinct elements | 4 |
Space group number | 14 |
Hermann-Mauguin space group symbol | P 1 21/n 1 |
Hall space group symbol | -P 2yn |
Residual factor for all reflections | 0.2165 |
Residual factor for significantly intense reflections | 0.0972 |
Weighted residual factors for significantly intense reflections | 0.2728 |
Weighted residual factors for all reflections included in the refinement | 0.3322 |
Goodness-of-fit parameter for all reflections included in the refinement | 1.034 |
Diffraction radiation wavelength | 0.71073 Å |
Diffraction radiation type | MoKα |