Information card for entry 7700829
Formula | C41 H52.5 N2.5 O5 V |
Calculated formula | C41 H52.5 N2.5 O5 V |
Title of publication | Stabilization of different redox levels of a tridentate benzoxazole amidophenoxide ligand when bound to Co(iii) or V(v). |
Authors of publication | Safaei, Elham; Balaghi, S. Esmael; Chiang, Linus; Clarke, Ryan M.; Martelino, Diego; Webb, Michael I.; Wong, Edwin W. Y.; Savard, Didier; Walsby, Charles J.; Storr, Tim |
Journal of publication | Dalton transactions (Cambridge, England : 2003) |
Year of publication | 2019 |
Journal volume | 48 |
Journal issue | 35 |
Pages of publication | 13326 - 13336 |
a | 18.8902 ± 0.0006 Å |
b | 12.6478 ± 0.0004 Å |
c | 34.8696 ± 0.001 Å |
α | 90° |
β | 91.657 ± 0.0017° |
γ | 90° |
Cell volume | 8327.5 ± 0.4 Å3 |
Cell temperature | 296 ± 2 K |
Ambient diffraction temperature | 296 ± 2 K |
Number of distinct elements | 5 |
Space group number | 14 |
Hermann-Mauguin space group symbol | P 1 21/n 1 |
Hall space group symbol | -P 2yn |
Residual factor for all reflections | 0.056 |
Residual factor for significantly intense reflections | 0.0427 |
Weighted residual factors for significantly intense reflections | 0.1151 |
Weighted residual factors for all reflections included in the refinement | 0.1238 |
Goodness-of-fit parameter for all reflections included in the refinement | 1.03 |
Diffraction radiation wavelength | 1.54178 Å |
Diffraction radiation type | CuKα |