Information card for entry 7700834
Formula | C60 H59 Cl4 Er2 Fe4 N13 O23 |
Calculated formula | C60 H59 Cl4 Er2 Fe4 N13 O23 |
Title of publication | Synthesis, crystal structures and magnetic properties of a series of chair-like heterometallic [Fe<sub>4</sub>Ln<sub>2</sub>] (Ln = Gd<sup>III</sup>, Dy<sup>III</sup>, Ho<sup>III</sup>, and Er<sup>III</sup>) complexes with mixed organic ligands. |
Authors of publication | Wang, Hui-Sheng; Long, Qiao-Qiao; Hu, Zhao-Bo; Yue, Lin; Yang, Feng-Jun; Yin, Cheng-Ling; Pan, Zhi-Quan; Zhang, Yi-Quan; Song, You |
Journal of publication | Dalton transactions (Cambridge, England : 2003) |
Year of publication | 2019 |
Journal volume | 48 |
Journal issue | 35 |
Pages of publication | 13472 - 13482 |
a | 13.8617 ± 0.0007 Å |
b | 15.6909 ± 0.0008 Å |
c | 20.7168 ± 0.0009 Å |
α | 81.361 ± 0.002° |
β | 83.042 ± 0.002° |
γ | 66.101 ± 0.002° |
Cell volume | 4063.8 ± 0.3 Å3 |
Cell temperature | 173 ± 2 K |
Ambient diffraction temperature | 173 ± 2 K |
Number of distinct elements | 7 |
Space group number | 2 |
Hermann-Mauguin space group symbol | P -1 |
Hall space group symbol | -P 1 |
Residual factor for all reflections | 0.0741 |
Residual factor for significantly intense reflections | 0.0418 |
Weighted residual factors for significantly intense reflections | 0.0812 |
Weighted residual factors for all reflections included in the refinement | 0.0874 |
Goodness-of-fit parameter for all reflections included in the refinement | 1.032 |
Diffraction radiation wavelength | 0.71073 Å |
Diffraction radiation type | MoKα |