Information card for entry 7700838
Formula | C49 H22 Cl2 Fe4 N4 O20 S4 |
Calculated formula | C49 H22 Cl2 Fe4 N4 O20 S4 |
Title of publication | Proton-coupled electron transfer in the reduction of diiron hexacarbonyl complexes and its enhancement on the electrocatalytic reduction of protons by a pendant basic group. |
Authors of publication | Zhong, Wei; Wu, Li; Jiang, Weidong; Li, Yulong; Mookan, Natarajan; Liu, Xiaoming |
Journal of publication | Dalton transactions (Cambridge, England : 2003) |
Year of publication | 2019 |
Journal volume | 48 |
Journal issue | 36 |
Pages of publication | 13711 - 13718 |
a | 17.687 ± 0.004 Å |
b | 16.553 ± 0.004 Å |
c | 18.948 ± 0.004 Å |
α | 90° |
β | 91.001 ± 0.003° |
γ | 90° |
Cell volume | 5547 ± 2 Å3 |
Cell temperature | 296 ± 2 K |
Ambient diffraction temperature | 296.15 K |
Number of distinct elements | 7 |
Space group number | 14 |
Hermann-Mauguin space group symbol | P 1 21/n 1 |
Hall space group symbol | -P 2yn |
Residual factor for all reflections | 0.0957 |
Residual factor for significantly intense reflections | 0.0479 |
Weighted residual factors for significantly intense reflections | 0.1085 |
Weighted residual factors for all reflections included in the refinement | 0.1276 |
Goodness-of-fit parameter for all reflections included in the refinement | 1.016 |
Diffraction radiation wavelength | 0.71073 Å |
Diffraction radiation type | MoKα |