Information card for entry 7700841
Formula | C44 H36 Fe2 Hg P2 |
Calculated formula | C44 H36 Fe2 Hg P2 |
Title of publication | Diferrocenylmercury diphosphine diastereomers with unique geometries: trans-chelation at Pd(ii) with short Hg(ii)Pd(ii) contacts. |
Authors of publication | Tagne Kuate, Alain C.; Lalancette, Roger A.; Bannenberg, Thomas; Tamm, Matthias; Jäkle, Frieder |
Journal of publication | Dalton transactions (Cambridge, England : 2003) |
Year of publication | 2019 |
Journal volume | 48 |
Journal issue | 35 |
Pages of publication | 13430 - 13439 |
a | 7.252 ± 0.0001 Å |
b | 13.2449 ± 0.0002 Å |
c | 18.3975 ± 0.0002 Å |
α | 90° |
β | 92.644 ± 0.001° |
γ | 90° |
Cell volume | 1765.24 ± 0.04 Å3 |
Cell temperature | 100 ± 2 K |
Ambient diffraction temperature | 100 ± 2 K |
Number of distinct elements | 5 |
Space group number | 14 |
Hermann-Mauguin space group symbol | P 1 21/n 1 |
Hall space group symbol | -P 2yn |
Residual factor for all reflections | 0.0265 |
Residual factor for significantly intense reflections | 0.0252 |
Weighted residual factors for significantly intense reflections | 0.0621 |
Weighted residual factors for all reflections included in the refinement | 0.0629 |
Goodness-of-fit parameter for all reflections included in the refinement | 1.039 |
Diffraction radiation wavelength | 1.54178 Å |
Diffraction radiation type | CuKα |