Information card for entry 7700843
Formula | C44 H36 Fe2 Hg P2 |
Calculated formula | C44 H36 Fe2 Hg P2 |
Title of publication | Diferrocenylmercury diphosphine diastereomers with unique geometries: trans-chelation at Pd(ii) with short Hg(ii)Pd(ii) contacts. |
Authors of publication | Tagne Kuate, Alain C.; Lalancette, Roger A.; Bannenberg, Thomas; Tamm, Matthias; Jäkle, Frieder |
Journal of publication | Dalton transactions (Cambridge, England : 2003) |
Year of publication | 2019 |
Journal volume | 48 |
Journal issue | 35 |
Pages of publication | 13430 - 13439 |
a | 11.0312 ± 0.0002 Å |
b | 12.8295 ± 0.0002 Å |
c | 15.0553 ± 0.0002 Å |
α | 114.463 ± 0.001° |
β | 96.008 ± 0.001° |
γ | 101.445 ± 0.001° |
Cell volume | 1858.71 ± 0.06 Å3 |
Cell temperature | 296 ± 2 K |
Ambient diffraction temperature | 296 ± 2 K |
Number of distinct elements | 5 |
Space group number | 2 |
Hermann-Mauguin space group symbol | P -1 |
Hall space group symbol | -P 1 |
Residual factor for all reflections | 0.0284 |
Residual factor for significantly intense reflections | 0.026 |
Weighted residual factors for significantly intense reflections | 0.0652 |
Weighted residual factors for all reflections included in the refinement | 0.0665 |
Goodness-of-fit parameter for all reflections included in the refinement | 1.03 |
Diffraction radiation wavelength | 1.54178 Å |
Diffraction radiation type | CuKα |