Information card for entry 7700864
Formula | C52 H44 Cl7 Fe N4 Sb |
Calculated formula | C52 H44 Cl7 Fe N4 Sb |
Title of publication | Assessment of the intramolecular magnetic interactions in the highly saddled iron(iii) porphyrin π-radical cations: the change from planar to saddle conformations. |
Authors of publication | Chen, Ching-Chin; Wu, Yi-Wen; Nakamura, Mikio; Cheng, Ru-Jen; Tseng, Tzu-Hsien; Chen, Peter P.-Y. |
Journal of publication | Dalton transactions (Cambridge, England : 2003) |
Year of publication | 2019 |
Journal volume | 48 |
Journal issue | 36 |
Pages of publication | 13820 - 13833 |
a | 16.944 ± 0.002 Å |
b | 34.231 ± 0.005 Å |
c | 9.7978 ± 0.0011 Å |
α | 90° |
β | 90° |
γ | 90° |
Cell volume | 5682.8 ± 1.2 Å3 |
Cell temperature | 150 ± 2 K |
Ambient diffraction temperature | 150 ± 2 K |
Number of distinct elements | 6 |
Space group number | 36 |
Hermann-Mauguin space group symbol | C m c 21 |
Hall space group symbol | C 2c -2 |
Residual factor for all reflections | 0.039 |
Residual factor for significantly intense reflections | 0.0368 |
Weighted residual factors for significantly intense reflections | 0.1213 |
Weighted residual factors for all reflections included in the refinement | 0.1244 |
Goodness-of-fit parameter for all reflections included in the refinement | 1.045 |
Diffraction radiation wavelength | 0.71073 Å |
Diffraction radiation type | MoKα |