Information card for entry 7700883
Formula | C29 H14 Co F15 N4 O4 |
Calculated formula | C29 H14 Co F15 N4 O4 |
Title of publication | Probing through-space and through-bond magnetic exchange couplings in a new benzotriazinyl radical and its metal complexes. |
Authors of publication | Nasani, Rajendar; Sidharth, Thulaseedharan Nair Sailaja; Roy, Subhadip; Mondal, Arpan; Rawson, Jeremy M.; Konar, Sanjit |
Journal of publication | Dalton transactions (Cambridge, England : 2003) |
Year of publication | 2019 |
Journal volume | 48 |
Journal issue | 37 |
Pages of publication | 14189 - 14200 |
a | 13.7407 ± 0.0011 Å |
b | 23.4881 ± 0.0018 Å |
c | 21.1641 ± 0.0017 Å |
α | 90° |
β | 105.5 ± 0.004° |
γ | 90° |
Cell volume | 6582.1 ± 0.9 Å3 |
Cell temperature | 140 ± 2 K |
Ambient diffraction temperature | 140.01 K |
Number of distinct elements | 6 |
Space group number | 14 |
Hermann-Mauguin space group symbol | P 1 21/n 1 |
Hall space group symbol | -P 2yn |
Residual factor for all reflections | 0.1783 |
Residual factor for significantly intense reflections | 0.0829 |
Weighted residual factors for significantly intense reflections | 0.2291 |
Weighted residual factors for all reflections included in the refinement | 0.2789 |
Goodness-of-fit parameter for all reflections included in the refinement | 1.045 |
Diffraction radiation wavelength | 0.71073 Å |
Diffraction radiation type | MoKα |