Information card for entry 7700910
Chemical name | {(3-methoxy-2-oxidobenzylidene)ethylenediamine}-nickel(II)-trichlorido-aqua-dysprosium(III) |
Formula | C18 H20 Cl3 Dy N2 Ni O5 |
Calculated formula | C18 H20 Cl3 Dy N2 Ni O5 |
Title of publication | Slow magnetic relaxation in Ni-Ln (Ln = Ce, Gd, Dy) dinuclear complexes. |
Authors of publication | Vráblová, Anna; Tomás, Milagros; Falvello, Larry R.; Dlháň, Ľubor; Titiš, Ján; Černák, Juraj; Boča, Roman |
Journal of publication | Dalton transactions (Cambridge, England : 2003) |
Year of publication | 2019 |
Journal volume | 48 |
Journal issue | 37 |
Pages of publication | 13943 - 13952 |
a | 7.0094 ± 0.0001 Å |
b | 14.3916 ± 0.0003 Å |
c | 20.9556 ± 0.0005 Å |
α | 90° |
β | 91.833 ± 0.002° |
γ | 90° |
Cell volume | 2112.85 ± 0.07 Å3 |
Cell temperature | 293 ± 2 K |
Ambient diffraction temperature | 293 ± 2 K |
Number of distinct elements | 7 |
Space group number | 14 |
Hermann-Mauguin space group symbol | P 1 21/n 1 |
Hall space group symbol | -P 2yn |
Residual factor for all reflections | 0.0577 |
Residual factor for significantly intense reflections | 0.0338 |
Weighted residual factors for significantly intense reflections | 0.0587 |
Weighted residual factors for all reflections included in the refinement | 0.0671 |
Goodness-of-fit parameter for all reflections included in the refinement | 1.038 |
Diffraction radiation wavelength | 0.71073 Å |
Diffraction radiation type | MoKα |