Information card for entry 7700917
Formula | C18 H21 Cl N5 O4 Re |
Calculated formula | C18 H21 Cl N5 O4 Re |
Title of publication | Rhenium bipyridine catalysts with hydrogen bonding pendant amines for CO<sub>2</sub> reduction. |
Authors of publication | Hellman, Ashley N.; Haiges, Ralf; Marinescu, Smaranda C. |
Journal of publication | Dalton transactions (Cambridge, England : 2003) |
Year of publication | 2019 |
Journal volume | 48 |
Journal issue | 38 |
Pages of publication | 14251 - 14255 |
a | 8.953 ± 0.003 Å |
b | 9.085 ± 0.003 Å |
c | 13.399 ± 0.004 Å |
α | 80.373 ± 0.004° |
β | 76.566 ± 0.004° |
γ | 78.668 ± 0.004° |
Cell volume | 1030.9 ± 0.6 Å3 |
Cell temperature | 100 ± 2 K |
Ambient diffraction temperature | 100 ± 2 K |
Number of distinct elements | 6 |
Space group number | 2 |
Hermann-Mauguin space group symbol | P -1 |
Hall space group symbol | -P 1 |
Residual factor for all reflections | 0.0259 |
Residual factor for significantly intense reflections | 0.0219 |
Weighted residual factors for significantly intense reflections | 0.0488 |
Weighted residual factors for all reflections included in the refinement | 0.0501 |
Goodness-of-fit parameter for all reflections included in the refinement | 1.068 |
Diffraction radiation wavelength | 0.71073 Å |
Diffraction radiation type | MoKα |