Information card for entry 7700920
Common name | Ashley_bisNMe2 |
Formula | C18 H19 Cl4 N4 O3 Re |
Calculated formula | C18 H19 Cl4 N4 O3 Re |
Title of publication | Rhenium bipyridine catalysts with hydrogen bonding pendant amines for CO<sub>2</sub> reduction. |
Authors of publication | Hellman, Ashley N.; Haiges, Ralf; Marinescu, Smaranda C. |
Journal of publication | Dalton transactions (Cambridge, England : 2003) |
Year of publication | 2019 |
Journal volume | 48 |
Journal issue | 38 |
Pages of publication | 14251 - 14255 |
a | 9.368 ± 0.005 Å |
b | 11.275 ± 0.006 Å |
c | 11.587 ± 0.006 Å |
α | 75.978 ± 0.009° |
β | 76.488 ± 0.008° |
γ | 81.595 ± 0.008° |
Cell volume | 1149.3 ± 1.1 Å3 |
Cell temperature | 100 ± 2 K |
Ambient diffraction temperature | 100 ± 2 K |
Number of distinct elements | 6 |
Space group number | 2 |
Hermann-Mauguin space group symbol | P -1 |
Hall space group symbol | -P 1 |
Residual factor for all reflections | 0.1429 |
Residual factor for significantly intense reflections | 0.1016 |
Weighted residual factors for significantly intense reflections | 0.2579 |
Weighted residual factors for all reflections included in the refinement | 0.2963 |
Goodness-of-fit parameter for all reflections included in the refinement | 1.028 |
Diffraction radiation wavelength | 0.71073 Å |
Diffraction radiation type | MoKα |