Information card for entry 7700922
Formula | C48 H62 Co N8 Na2 O18 |
Calculated formula | C46 H28 Co N6 Na2 O18 |
Title of publication | Two microporous Co<sup>II</sup>-MOFs with dual active sites for highly selective adsorption of CO<sub>2</sub>/CH<sub>4</sub> and CO<sub>2</sub>/N<sub>2</sub>. |
Authors of publication | Ma, Hui-Yan; Zhang, Yong-Zheng; Yan, Hui; Zhang, Wen-Jie; Li, Yun-Wu; Wang, Su-Na; Li, Da-Cheng; Dou, Jian-Min; Li, Jian-Rong |
Journal of publication | Dalton transactions (Cambridge, England : 2003) |
Year of publication | 2019 |
Journal volume | 48 |
Journal issue | 36 |
Pages of publication | 13541 - 13545 |
a | 17.6254 ± 0.0016 Å |
b | 19.9755 ± 0.0015 Å |
c | 15.3066 ± 0.0011 Å |
α | 90° |
β | 104.504 ± 0.008° |
γ | 90° |
Cell volume | 5217.3 ± 0.7 Å3 |
Cell temperature | 100 ± 2 K |
Ambient diffraction temperature | 100 ± 2 K |
Number of distinct elements | 6 |
Space group number | 15 |
Hermann-Mauguin space group symbol | C 1 2/c 1 |
Hall space group symbol | -C 2yc |
Residual factor for all reflections | 0.1261 |
Residual factor for significantly intense reflections | 0.1128 |
Weighted residual factors for significantly intense reflections | 0.3335 |
Weighted residual factors for all reflections included in the refinement | 0.3526 |
Goodness-of-fit parameter for all reflections included in the refinement | 1.105 |
Diffraction radiation wavelength | 1.54184 Å |
Diffraction radiation type | CuKα |