Information card for entry 7700924
Formula | C12 H36 N3 O143 P4 Pr3 W34 |
Calculated formula | C12 H36 N3 O143 P4 Pr3 W34 |
Title of publication | Synthesis, characterization, and photoluminescence properties of three two-dimensional lanthanide-containing Dawson-type polyoxometalates. |
Authors of publication | Wu, Hechen; Zhi, Minna; Chen, Chunli; Zhu, Yanhong; Ma, Pengtao; Wang, Jingping; Niu, Jingyang |
Journal of publication | Dalton transactions (Cambridge, England : 2003) |
Year of publication | 2019 |
Journal volume | 48 |
Journal issue | 36 |
Pages of publication | 13850 - 13857 |
a | 25.252 ± 0.003 Å |
b | 15.1277 ± 0.0016 Å |
c | 28.898 ± 0.003 Å |
α | 90° |
β | 105.328 ± 0.0018° |
γ | 90° |
Cell volume | 10646 ± 2 Å3 |
Cell temperature | 296 ± 2 K |
Ambient diffraction temperature | 296.15 K |
Number of distinct elements | 7 |
Space group number | 7 |
Hermann-Mauguin space group symbol | P 1 n 1 |
Hall space group symbol | P -2yac |
Residual factor for all reflections | 0.1026 |
Residual factor for significantly intense reflections | 0.0649 |
Weighted residual factors for significantly intense reflections | 0.1419 |
Weighted residual factors for all reflections included in the refinement | 0.1649 |
Goodness-of-fit parameter for all reflections included in the refinement | 1.015 |
Diffraction radiation wavelength | 0.71073 Å |
Diffraction radiation type | MoKα |