Information card for entry 7700926
Formula | C116 H72 B2 F48 Pd2 |
Calculated formula | C116 H70 B2 F48 Pd2 |
Title of publication | Photo-induced translocation of a Pd<sub>n</sub> moiety (n = 2, 7) on a conjugated polyene ligand. |
Authors of publication | Yamashita, Mitsuki; Horiuchi, Shinnosuke; Yamamoto, Koji; Murahashi, Tetsuro |
Journal of publication | Dalton transactions (Cambridge, England : 2003) |
Year of publication | 2019 |
Journal volume | 48 |
Journal issue | 35 |
Pages of publication | 13149 - 13153 |
a | 12.726 ± 0.006 Å |
b | 15.716 ± 0.008 Å |
c | 17.246 ± 0.008 Å |
α | 110.283 ± 0.007° |
β | 93.222 ± 0.004° |
γ | 107.949 ± 0.005° |
Cell volume | 3026 ± 3 Å3 |
Cell temperature | 93 K |
Ambient diffraction temperature | 93 K |
Number of distinct elements | 5 |
Space group number | 2 |
Hermann-Mauguin space group symbol | P -1 |
Hall space group symbol | -P 1 |
Residual factor for all reflections | 0.1186 |
Residual factor for significantly intense reflections | 0.0825 |
Weighted residual factors for significantly intense reflections | 0.1954 |
Weighted residual factors for all reflections included in the refinement | 0.2197 |
Goodness-of-fit parameter for all reflections included in the refinement | 0.958 |
Diffraction radiation wavelength | 0.71075 Å |
Diffraction radiation type | MoKα |