Information card for entry 7700937
Formula | C89 H75 P3 Ru Zn |
Calculated formula | C89 H75 P3 Ru Zn |
Title of publication | Transforming PPh<sub>3</sub> into bidentate phosphine ligands at Ru-Zn heterobimetallic complexes. |
Authors of publication | O'Leary, Niall; Miloserdov, Fedor M.; Mahon, Mary F.; Whittlesey, Michael K. |
Journal of publication | Dalton transactions (Cambridge, England : 2003) |
Year of publication | 2019 |
Journal volume | 48 |
Journal issue | 37 |
Pages of publication | 14000 - 14009 |
a | 17.33241 ± 0.00012 Å |
b | 23.86672 ± 0.00017 Å |
c | 33.9755 ± 0.0003 Å |
α | 90° |
β | 90° |
γ | 90° |
Cell volume | 14054.6 ± 0.19 Å3 |
Cell temperature | 150 ± 0.1 K |
Ambient diffraction temperature | 150 ± 0.1 K |
Number of distinct elements | 5 |
Space group number | 61 |
Hermann-Mauguin space group symbol | P b c a |
Hall space group symbol | -P 2ac 2ab |
Residual factor for all reflections | 0.0346 |
Residual factor for significantly intense reflections | 0.0293 |
Weighted residual factors for significantly intense reflections | 0.0715 |
Weighted residual factors for all reflections included in the refinement | 0.0749 |
Goodness-of-fit parameter for all reflections included in the refinement | 1.014 |
Diffraction radiation probe | x-ray |
Diffraction radiation wavelength | 1.54184 Å |
Diffraction radiation type | CuKα |