Information card for entry 7700944
Formula | C45 H58 Mn3 N12 O11 |
Calculated formula | C45 H58 Mn3 N12 O11 |
Title of publication | The effect of the orientation of the Jahn-Teller distortion on the magnetic interactions of trinuclear mixed-valence Mn(ii)/Mn(iii) complexes. |
Authors of publication | Bikas, Rahman; Shahmoradi, Elaheh; Reinoso, Santiago; Emami, Marzieh; Lezama, Luis; Sanchiz, Joaquín; Noshiranzadeh, Nader |
Journal of publication | Dalton transactions (Cambridge, England : 2003) |
Year of publication | 2019 |
Journal volume | 48 |
Journal issue | 36 |
Pages of publication | 13799 - 13812 |
a | 13.06284 ± 0.00012 Å |
b | 27.2891 ± 0.0003 Å |
c | 13.51506 ± 0.00011 Å |
α | 90° |
β | 92.8012 ± 0.0008° |
γ | 90° |
Cell volume | 4812 ± 0.08 Å3 |
Cell temperature | 100 ± 2 K |
Ambient diffraction temperature | 100 ± 2 K |
Number of distinct elements | 5 |
Space group number | 14 |
Hermann-Mauguin space group symbol | P 1 21/n 1 |
Hall space group symbol | -P 2yn |
Residual factor for all reflections | 0.0366 |
Residual factor for significantly intense reflections | 0.0315 |
Weighted residual factors for significantly intense reflections | 0.0767 |
Weighted residual factors for all reflections included in the refinement | 0.0789 |
Goodness-of-fit parameter for all reflections included in the refinement | 1.032 |
Diffraction radiation wavelength | 1.54184 Å |
Diffraction radiation type | CuKα |