Information card for entry 7700954
Formula | C72 H116 N2 O6 Zn3 |
Calculated formula | C72 H116 N2 O6 Zn3 |
Title of publication | Bimetallic and trimetallic zinc amino-bis(phenolate) complexes for ring-opening polymerization of rac-lactide. |
Authors of publication | Liu, Yi; Dawe, Louise N.; Kozak, Christopher M. |
Journal of publication | Dalton transactions (Cambridge, England : 2003) |
Year of publication | 2019 |
Journal volume | 48 |
Journal issue | 36 |
Pages of publication | 13699 - 13710 |
a | 13.4644 ± 0.0009 Å |
b | 28.1652 ± 0.0019 Å |
c | 20.0841 ± 0.0014 Å |
α | 90° |
β | 104.208 ± 0.001° |
γ | 90° |
Cell volume | 7383.5 ± 0.9 Å3 |
Cell temperature | 125 ± 2 K |
Ambient diffraction temperature | 125.02 K |
Number of distinct elements | 5 |
Space group number | 14 |
Hermann-Mauguin space group symbol | P 1 21/c 1 |
Hall space group symbol | -P 2ybc |
Residual factor for all reflections | 0.0805 |
Residual factor for significantly intense reflections | 0.0426 |
Weighted residual factors for significantly intense reflections | 0.0871 |
Weighted residual factors for all reflections included in the refinement | 0.0995 |
Goodness-of-fit parameter for all reflections included in the refinement | 1.013 |
Diffraction radiation wavelength | 0.71073 Å |
Diffraction radiation type | MoKα |