Information card for entry 7700975
Formula | C80 H78 Au2 B2 Cl4 F6 N12 O10 P2 S2 W2 |
Calculated formula | C80 H78 Au2 B2 Cl4 F6 N12 O10 P2 S2 W2 |
Title of publication | Metal coordination to a dimetallaoctatetrayne. |
Authors of publication | Delaney, Andie R.; Frogley, Benjamin J.; Hill, Anthony F. |
Journal of publication | Dalton transactions (Cambridge, England : 2003) |
Year of publication | 2019 |
Journal volume | 48 |
Journal issue | 36 |
Pages of publication | 13674 - 13684 |
a | 12.8027 ± 0.0007 Å |
b | 13.1649 ± 0.0008 Å |
c | 14.8124 ± 0.0008 Å |
α | 66.855 ± 0.005° |
β | 80.31 ± 0.005° |
γ | 76.38 ± 0.005° |
Cell volume | 2223 ± 0.2 Å3 |
Cell temperature | 150 ± 0.1 K |
Ambient diffraction temperature | 150 ± 0.1 K |
Number of distinct elements | 11 |
Space group number | 2 |
Hermann-Mauguin space group symbol | P -1 |
Hall space group symbol | -P 1 |
Residual factor for all reflections | 0.0743 |
Residual factor for significantly intense reflections | 0.049 |
Weighted residual factors for significantly intense reflections | 0.1204 |
Weighted residual factors for all reflections included in the refinement | 0.1362 |
Goodness-of-fit parameter for all reflections included in the refinement | 1.009 |
Diffraction radiation wavelength | 1.54184 Å |
Diffraction radiation type | CuKα |