Information card for entry 7700989
Formula | C57 H85 I3 O3 |
Calculated formula | C57 H85 I3 O3 |
Title of publication | A new bis-phenolate mesoionic carbene ligand for early transition metal chemistry. |
Authors of publication | Baltrun, Marc; Watt, Fabian A.; Schoch, Roland; Wölper, Christoph; Neuba, Adam G.; Hohloch, Stephan |
Journal of publication | Dalton transactions (Cambridge, England : 2003) |
Year of publication | 2019 |
Journal volume | 48 |
Journal issue | 39 |
Pages of publication | 14611 - 14625 |
a | 6.1247 ± 0.0001 Å |
b | 22.0786 ± 0.0002 Å |
c | 22.7088 ± 0.0002 Å |
α | 117.896 ± 0.001° |
β | 90.672 ± 0.001° |
γ | 92.124 ± 0.001° |
Cell volume | 2710.63 ± 0.06 Å3 |
Cell temperature | 100 ± 2 K |
Ambient diffraction temperature | 100 ± 2 K |
Number of distinct elements | 4 |
Space group number | 1 |
Hermann-Mauguin space group symbol | P 1 |
Hall space group symbol | P 1 |
Residual factor for all reflections | 0.0457 |
Residual factor for significantly intense reflections | 0.0447 |
Weighted residual factors for significantly intense reflections | 0.1205 |
Weighted residual factors for all reflections included in the refinement | 0.1214 |
Goodness-of-fit parameter for all reflections included in the refinement | 1.055 |
Diffraction radiation probe | x-ray |
Diffraction radiation wavelength | 1.54178 Å |
Diffraction radiation type | CuKα |