Information card for entry 7700992
Formula | C30 H43 N3 O2 |
Calculated formula | C30 H43 N3 O2 |
Title of publication | A new bis-phenolate mesoionic carbene ligand for early transition metal chemistry. |
Authors of publication | Baltrun, Marc; Watt, Fabian A.; Schoch, Roland; Wölper, Christoph; Neuba, Adam G.; Hohloch, Stephan |
Journal of publication | Dalton transactions (Cambridge, England : 2003) |
Year of publication | 2019 |
Journal volume | 48 |
Journal issue | 39 |
Pages of publication | 14611 - 14625 |
a | 26.76 ± 0.005 Å |
b | 10.17 ± 0.002 Å |
c | 11.17 ± 0.002 Å |
α | 90° |
β | 114.1 ± 0.03° |
γ | 90° |
Cell volume | 2774.9 ± 1.1 Å3 |
Cell temperature | 130 ± 2 K |
Ambient diffraction temperature | 130 ± 2 K |
Number of distinct elements | 4 |
Space group number | 15 |
Hermann-Mauguin space group symbol | C 1 2/c 1 |
Hall space group symbol | -C 2yc |
Residual factor for all reflections | 0.0855 |
Residual factor for significantly intense reflections | 0.0535 |
Weighted residual factors for significantly intense reflections | 0.1164 |
Weighted residual factors for all reflections included in the refinement | 0.1273 |
Goodness-of-fit parameter for all reflections included in the refinement | 1.038 |
Diffraction radiation wavelength | 0.71073 Å |
Diffraction radiation type | MoKα |