Information card for entry 7700995
Formula | C40 H57 N5 O2 Ti |
Calculated formula | C40 H57 N5 O2 Ti |
Title of publication | A new bis-phenolate mesoionic carbene ligand for early transition metal chemistry. |
Authors of publication | Baltrun, Marc; Watt, Fabian A.; Schoch, Roland; Wölper, Christoph; Neuba, Adam G.; Hohloch, Stephan |
Journal of publication | Dalton transactions (Cambridge, England : 2003) |
Year of publication | 2019 |
Journal volume | 48 |
Journal issue | 39 |
Pages of publication | 14611 - 14625 |
a | 9.374 ± 0.003 Å |
b | 16.81 ± 0.005 Å |
c | 25.014 ± 0.008 Å |
α | 90° |
β | 90.8 ± 0.006° |
γ | 90° |
Cell volume | 3941 ± 2 Å3 |
Cell temperature | 130 ± 2 K |
Ambient diffraction temperature | 130 ± 2 K |
Number of distinct elements | 5 |
Space group number | 14 |
Hermann-Mauguin space group symbol | P 1 21/n 1 |
Hall space group symbol | -P 2yn |
Residual factor for all reflections | 0.1504 |
Residual factor for significantly intense reflections | 0.0899 |
Weighted residual factors for significantly intense reflections | 0.2126 |
Weighted residual factors for all reflections included in the refinement | 0.2468 |
Goodness-of-fit parameter for all reflections included in the refinement | 1.069 |
Diffraction radiation wavelength | 0.71073 Å |
Diffraction radiation type | MoKα |