Information card for entry 7701009
Formula | C16 H17 Cl F3 N3 O2 Pt S |
Calculated formula | C16 H17 Cl F3 N3 O2 Pt S |
Title of publication | A family of readily synthesised phosphorescent platinum(ii) complexes based on tridentate N^N^O-coordinating Schiff-base ligands. |
Authors of publication | Puttock, Emma V.; Fradgley, Jack D.; Yufit, Dmitry S.; Williams, J. A. Gareth |
Journal of publication | Dalton transactions (Cambridge, England : 2003) |
Year of publication | 2019 |
Journal volume | 48 |
Journal issue | 40 |
Pages of publication | 15012 - 15028 |
a | 11.5812 ± 0.0005 Å |
b | 6.8946 ± 0.0003 Å |
c | 23.2291 ± 0.0009 Å |
α | 90° |
β | 90° |
γ | 90° |
Cell volume | 1854.79 ± 0.13 Å3 |
Cell temperature | 120 K |
Ambient diffraction temperature | 120 K |
Number of distinct elements | 8 |
Space group number | 62 |
Hermann-Mauguin space group symbol | P n m a |
Hall space group symbol | -P 2ac 2n |
Residual factor for all reflections | 0.026 |
Residual factor for significantly intense reflections | 0.0212 |
Weighted residual factors for significantly intense reflections | 0.037 |
Weighted residual factors for all reflections included in the refinement | 0.0384 |
Goodness-of-fit parameter for all reflections included in the refinement | 1.188 |
Diffraction radiation probe | x-ray |
Diffraction radiation wavelength | 0.71073 Å |
Diffraction radiation type | MoKα |