Information card for entry 7701011
Formula | C42 H35 Au N P S |
Calculated formula | C42 H35 Au N P S |
Title of publication | Photophysical properties of organogold(i) complexes bearing a benzothiazole-2,7-fluorenyl moiety: selection of ancillary ligand influences white light emission. |
Authors of publication | Mihaly, Joseph J.; Stewart, David J.; Grusenmeyer, Tod A.; Phillips, Alexis T.; Haley, Joy E.; Zeller, Matthias; Gray, Thomas G. |
Journal of publication | Dalton transactions (Cambridge, England : 2003) |
Year of publication | 2019 |
Journal volume | 48 |
Journal issue | 42 |
Pages of publication | 15917 - 15927 |
a | 11.8146 ± 0.0005 Å |
b | 12.7494 ± 0.0006 Å |
c | 12.7733 ± 0.0006 Å |
α | 74.285 ± 0.002° |
β | 63.823 ± 0.002° |
γ | 83.926 ± 0.002° |
Cell volume | 1661.94 ± 0.14 Å3 |
Cell temperature | 150 ± 2 K |
Ambient diffraction temperature | 150 ± 2 K |
Number of distinct elements | 6 |
Space group number | 2 |
Hermann-Mauguin space group symbol | P -1 |
Hall space group symbol | -P 1 |
Residual factor for all reflections | 0.0402 |
Residual factor for significantly intense reflections | 0.0262 |
Weighted residual factors for significantly intense reflections | 0.0462 |
Weighted residual factors for all reflections included in the refinement | 0.0496 |
Goodness-of-fit parameter for all reflections included in the refinement | 1.019 |
Diffraction radiation wavelength | 0.71073 Å |
Diffraction radiation type | MoKα |