Information card for entry 7701021
Formula | C28 H37 F3 Gd N5 O6 |
Calculated formula | C28 H37 F3 Gd N5 O6 |
Title of publication | Comparison of two field-induced Er<sup>III</sup> single ion magnets. |
Authors of publication | Kühne, Irina A; Ungur, Liviu; Esien, Kane; Carter, Anthony B.; Gordon, John D.; Pauly, Cameron; Müller-Bunz, Helge; Felton, Solveig; Zerulla, Dominic; Morgan, Grace G. |
Journal of publication | Dalton transactions (Cambridge, England : 2003) |
Year of publication | 2019 |
Journal volume | 48 |
Journal issue | 41 |
Pages of publication | 15679 - 15686 |
a | 12.7436 ± 0.0002 Å |
b | 16.4518 ± 0.0003 Å |
c | 14.9252 ± 0.0002 Å |
α | 90° |
β | 105.429 ± 0.002° |
γ | 90° |
Cell volume | 3016.37 ± 0.09 Å3 |
Cell temperature | 100 ± 2 K |
Ambient diffraction temperature | 100 ± 2 K |
Number of distinct elements | 6 |
Space group number | 14 |
Hermann-Mauguin space group symbol | P 1 21/c 1 |
Hall space group symbol | -P 2ybc |
Residual factor for all reflections | 0.0404 |
Residual factor for significantly intense reflections | 0.0359 |
Weighted residual factors for significantly intense reflections | 0.0892 |
Weighted residual factors for all reflections included in the refinement | 0.0925 |
Goodness-of-fit parameter for all reflections included in the refinement | 1.06 |
Diffraction radiation wavelength | 1.54184 Å |
Diffraction radiation type | CuKα |