Information card for entry 7701028
Formula | C22 H34 Mn N2 O4 P |
Calculated formula | C22 H34 Mn N2 O4 P |
Title of publication | CO<sub>2</sub> activation by manganese pincer complexes through different modes of metal-ligand cooperation. |
Authors of publication | Kumar, Amit; Daw, Prosenjit; Espinosa-Jalapa, Noel Angel; Leitus, Gregory; Shimon, Linda J. W.; Ben-David, Yehoshoa; Milstein, David |
Journal of publication | Dalton transactions (Cambridge, England : 2003) |
Year of publication | 2019 |
Journal volume | 48 |
Journal issue | 39 |
Pages of publication | 14580 - 14584 |
a | 11.0332 ± 0.0004 Å |
b | 11.6911 ± 0.0004 Å |
c | 17.3894 ± 0.0007 Å |
α | 90° |
β | 96.46 ± 0.004° |
γ | 90° |
Cell volume | 2228.82 ± 0.14 Å3 |
Cell temperature | 100 ± 2 K |
Ambient diffraction temperature | 100 ± 2 K |
Number of distinct elements | 6 |
Space group number | 14 |
Hermann-Mauguin space group symbol | P 1 21/c 1 |
Hall space group symbol | -P 2ybc |
Residual factor for all reflections | 0.0307 |
Residual factor for significantly intense reflections | 0.0268 |
Weighted residual factors for significantly intense reflections | 0.0655 |
Weighted residual factors for all reflections included in the refinement | 0.067 |
Goodness-of-fit parameter for all reflections included in the refinement | 1.064 |
Diffraction radiation wavelength | 1.54184 Å |
Diffraction radiation type | CuKα |