Information card for entry 7701030
Formula | C40 H67 Cl Ir O7 P3 Si2 |
Calculated formula | C40 H67 Cl Ir O7 P3 Si2 |
Title of publication | Iridium complexes featuring a tridentate SiPSi ligand: from dimeric to monomeric 14, 16 or 18-electron species. |
Authors of publication | Cuevas-Chávez, Cynthia A; Vendier, Laure; Sabo-Etienne, Sylviane; Montiel-Palma, Virginia |
Journal of publication | Dalton transactions (Cambridge, England : 2003) |
Year of publication | 2019 |
Journal volume | 48 |
Journal issue | 37 |
Pages of publication | 14010 - 14018 |
a | 10.171 ± 0.003 Å |
b | 15.591 ± 0.005 Å |
c | 28.733 ± 0.009 Å |
α | 90° |
β | 92.251 ± 0.008° |
γ | 90° |
Cell volume | 4553 ± 2 Å3 |
Cell temperature | 100 ± 2 K |
Ambient diffraction temperature | 100 ± 2 K |
Number of distinct elements | 7 |
Space group number | 14 |
Hermann-Mauguin space group symbol | P 1 21/c 1 |
Hall space group symbol | -P 2ybc |
Residual factor for all reflections | 0.035 |
Residual factor for significantly intense reflections | 0.0267 |
Weighted residual factors for significantly intense reflections | 0.0568 |
Weighted residual factors for all reflections included in the refinement | 0.0594 |
Goodness-of-fit parameter for all reflections included in the refinement | 1.083 |
Diffraction radiation probe | x-ray |
Diffraction radiation wavelength | 0.71073 Å |
Diffraction radiation type | MoKα |