Information card for entry 7701051
Formula | C40 H44 Ag4 N16 O8 |
Calculated formula | C40 H44 Ag4 N16 O8 |
Title of publication | Dinuclear zwitterionic silver(i) and gold(i) complexes bearing 2,2-acetate-bridged bisimidazolylidene ligands. |
Authors of publication | Dominelli, Bruno; Roberts, Gerri M.; Jandl, Christian; Fischer, Pauline J.; Reich, Robert M.; Pöthig, Alexander; Correia, João D G; Kühn, Fritz E |
Journal of publication | Dalton transactions (Cambridge, England : 2003) |
Year of publication | 2019 |
Journal volume | 48 |
Journal issue | 37 |
Pages of publication | 14036 - 14043 |
a | 11.3434 ± 0.0005 Å |
b | 12.6516 ± 0.0005 Å |
c | 12.7157 ± 0.0006 Å |
α | 107.761 ± 0.002° |
β | 99.703 ± 0.002° |
γ | 113.659 ± 0.002° |
Cell volume | 1500.65 ± 0.12 Å3 |
Cell temperature | 100 K |
Ambient diffraction temperature | 100 K |
Number of distinct elements | 5 |
Space group number | 2 |
Hermann-Mauguin space group symbol | P -1 |
Hall space group symbol | -P 1 |
Residual factor for all reflections | 0.0293 |
Residual factor for significantly intense reflections | 0.0226 |
Weighted residual factors for significantly intense reflections | 0.0459 |
Weighted residual factors for all reflections included in the refinement | 0.0477 |
Goodness-of-fit parameter for all reflections included in the refinement | 1.054 |
Diffraction radiation probe | x-ray |
Diffraction radiation wavelength | 0.71073 Å |
Diffraction radiation type | MoKα |