Information card for entry 7701055
Formula | C40 H61 Fe N2 O4 |
Calculated formula | C40 H61 Fe N2 O4 |
Title of publication | The synthesis, characterisation and application of iron(iii)-acetate complexes for cyclic carbonate formation and the polymerisation of lactide. |
Authors of publication | Driscoll, Oliver J.; Hafford-Tear, Claudia H; McKeown, Paul; Stewart, Jack A.; Kociok-Köhn, Gabriele; Mahon, Mary F.; Jones, Matthew D. |
Journal of publication | Dalton transactions (Cambridge, England : 2003) |
Year of publication | 2019 |
Journal volume | 48 |
Journal issue | 40 |
Pages of publication | 15049 - 15058 |
a | 10.9269 ± 0.0007 Å |
b | 13.1291 ± 0.001 Å |
c | 14.0182 ± 0.0007 Å |
α | 87.693 ± 0.005° |
β | 81.168 ± 0.004° |
γ | 80.394 ± 0.006° |
Cell volume | 1959.1 ± 0.2 Å3 |
Cell temperature | 150 ± 2 K |
Ambient diffraction temperature | 149.7 ± 0.5 K |
Number of distinct elements | 5 |
Space group number | 2 |
Hermann-Mauguin space group symbol | P -1 |
Hall space group symbol | -P 1 |
Residual factor for all reflections | 0.0747 |
Residual factor for significantly intense reflections | 0.0515 |
Weighted residual factors for significantly intense reflections | 0.1109 |
Weighted residual factors for all reflections included in the refinement | 0.1194 |
Goodness-of-fit parameter for all reflections included in the refinement | 1.016 |
Diffraction radiation probe | x-ray |
Diffraction radiation wavelength | 1.54184 Å |
Diffraction radiation type | CuKα |