Information card for entry 7701059
Formula | C38 H57 Fe N2 O4 |
Calculated formula | C38 H57 Fe N2 O4 |
Title of publication | The synthesis, characterisation and application of iron(iii)-acetate complexes for cyclic carbonate formation and the polymerisation of lactide. |
Authors of publication | Driscoll, Oliver J.; Hafford-Tear, Claudia H; McKeown, Paul; Stewart, Jack A.; Kociok-Köhn, Gabriele; Mahon, Mary F.; Jones, Matthew D. |
Journal of publication | Dalton transactions (Cambridge, England : 2003) |
Year of publication | 2019 |
Journal volume | 48 |
Journal issue | 40 |
Pages of publication | 15049 - 15058 |
a | 10.508 ± 0.0002 Å |
b | 22.7778 ± 0.0003 Å |
c | 15.3749 ± 0.0002 Å |
α | 90° |
β | 91.799 ± 0.001° |
γ | 90° |
Cell volume | 3678.15 ± 0.1 Å3 |
Cell temperature | 150 ± 2 K |
Ambient diffraction temperature | 150.01 ± 0.1 K |
Number of distinct elements | 5 |
Space group number | 14 |
Hermann-Mauguin space group symbol | P 1 21/n 1 |
Hall space group symbol | -P 2yn |
Residual factor for all reflections | 0.0494 |
Residual factor for significantly intense reflections | 0.0379 |
Weighted residual factors for significantly intense reflections | 0.0962 |
Weighted residual factors for all reflections included in the refinement | 0.101 |
Goodness-of-fit parameter for all reflections included in the refinement | 1.035 |
Diffraction radiation probe | x-ray |
Diffraction radiation wavelength | 1.54184 Å |
Diffraction radiation type | CuKα |