Information card for entry 7701088
Formula | C68 H53 B2 F30 N2 Na O6.5 |
Calculated formula | C68 H53 B2 F30 N2 Na O6.5 |
Title of publication | Imidazolyl-phenyl (IMP) anions: a modular structure for tuning solubility and coordinating ability. |
Authors of publication | Wozniak, Derek I.; Hicks, Andrew J.; Sabbers, William A.; Dobereiner, Graham E. |
Journal of publication | Dalton transactions (Cambridge, England : 2003) |
Year of publication | 2019 |
Journal volume | 48 |
Journal issue | 37 |
Pages of publication | 14138 - 14155 |
a | 12.7032 ± 0.0013 Å |
b | 13.4507 ± 0.0013 Å |
c | 20.407 ± 0.002 Å |
α | 91.293 ± 0.002° |
β | 91.963 ± 0.002° |
γ | 107.76 ± 0.002° |
Cell volume | 3316.8 ± 0.6 Å3 |
Cell temperature | 100 ± 2 K |
Ambient diffraction temperature | 99.95 K |
Number of distinct elements | 7 |
Space group number | 2 |
Hermann-Mauguin space group symbol | P -1 |
Hall space group symbol | -P 1 |
Residual factor for all reflections | 0.193 |
Residual factor for significantly intense reflections | 0.1031 |
Weighted residual factors for significantly intense reflections | 0.2907 |
Weighted residual factors for all reflections included in the refinement | 0.3639 |
Goodness-of-fit parameter for all reflections included in the refinement | 1.035 |
Diffraction radiation wavelength | 0.71073 Å |
Diffraction radiation type | MoKα |