Information card for entry 7701094
Formula | C84 H50 B2 Cl2 F33 N5 O Pd |
Calculated formula | C84 H50 B2 Cl2 F33 N5 O Pd |
Title of publication | Imidazolyl-phenyl (IMP) anions: a modular structure for tuning solubility and coordinating ability. |
Authors of publication | Wozniak, Derek I.; Hicks, Andrew J.; Sabbers, William A.; Dobereiner, Graham E. |
Journal of publication | Dalton transactions (Cambridge, England : 2003) |
Year of publication | 2019 |
Journal volume | 48 |
Journal issue | 37 |
Pages of publication | 14138 - 14155 |
a | 14.1686 ± 0.0015 Å |
b | 18.684 ± 0.002 Å |
c | 19.045 ± 0.002 Å |
α | 114.321 ± 0.004° |
β | 98.469 ± 0.004° |
γ | 107.83 ± 0.004° |
Cell volume | 4150.7 ± 0.8 Å3 |
Cell temperature | 100 ± 2 K |
Ambient diffraction temperature | 100.01 K |
Number of distinct elements | 8 |
Space group number | 2 |
Hermann-Mauguin space group symbol | P -1 |
Hall space group symbol | -P 1 |
Residual factor for all reflections | 0.2389 |
Residual factor for significantly intense reflections | 0.0804 |
Weighted residual factors for significantly intense reflections | 0.1421 |
Weighted residual factors for all reflections included in the refinement | 0.1929 |
Goodness-of-fit parameter for all reflections included in the refinement | 0.96 |
Diffraction radiation wavelength | 0.71073 Å |
Diffraction radiation type | MoKα |